{"text_format":"1","workbook":"xlsx","n_sheets":8,"sheets":["Dades pacient","Seguiment FEM Real","Consulta FEM Teoric","Càlcul FEM Real","Dades gràfic","Full Pacient","Grafic Setmanal","Bibliografia"],"not_rendered":{"charts":2,"images":6,"macros":1,"external_links":0,"defined_names":6,"comments":0,"pivot_tables":0},"unopened":[],"bounds":{"document_bytes":16777216,"sheet_cells":100000,"rows_first":2000,"rows_last":500,"rows_between":2000,"halvings":0,"cell_chars":16384,"cell_head_chars":4096},"cells_cut":0,"cells_raw":0,"read":"whole","date_system":"1900"}

{"sheet":"Dades pacient","index":0,"n_rows":35,"n_cols":8,"rows_kept":35,"cut":false,"hidden":false,"merged":[[35,1,35,4],[0,1,0,3],[1,7,2,8],[7,6,8,6],[7,7,8,8],[30,1,30,4],[34,1,34,4],[31,1,31,4],[32,1,32,4]]}
[null,"Dades pacient"]
[null,"Sexe","Edat","Alçada",null,null,null,{"$f":"IFERROR(('Consulta FEM Teoric'!D2),\"\")","v":0}]
[]
[]
[]
[null,"Dades per al càlcul del FEM Real del pacient"]
[null,"DIA","FEM MATI","FEM NIT","Variabilidad"]
[null,"Dia 1",null,null,{"$f":"IFERROR(((MAX(C8:D8)-MIN(C8:D8))/MAX(C8:D8))*100,\"\")","v":""},null,"FEM Real del pacient",{"$f":"'Dades gràfic'!G34","v":""}]
[null,"Dia 2",null,null,""]
[null,"Dia 3",null,null,""]
[null,"Dia 4",null,null,""]
[null,"Dia 5",null,null,""]
[null,"Dia 6",null,null,""]
[null,"Dia 7",null,null,""]
[null,"Dia 8",null,null,""]
[null,"Dia 9",null,null,""]
[null,"Dia 10",null,null,""]
[null,"Dia 11",null,null,""]
[null,"Dia 12",null,null,""]
[null,"Dia 13",null,null,""]
[null,"Dia 14",null,null,""]
[null,"Dia 15",null,null,""]
[]
[]
[null,"FEM 80%","FEM 60%","FEM 40%"]
[null,{"$f":"IFERROR('Dades gràfic'!D4,\"\")","v":""},{"$f":"IFERROR('Dades gràfic'!E4,\"\")","v":""},{"$f":"IFERROR('Dades gràfic'!F4,\"\")","v":""}]
[]
[]
[]
[]
[null,"Medicació entre el 60% de FEM i el 80% FEM "]
[]
[]
[]
[null,"Medicació entre el 40% de FEM i el 60% de FEM"]

{"sheet":"Seguiment FEM Real","index":1,"n_rows":35,"n_cols":6,"rows_kept":35,"cut":false,"hidden":false,"merged":[]}
["Dades Seguiment "]
[null,"Mes i any"]
[]
[null,"DIA","MATI","NIT","Variabilidad"]
[null,"Dia 1",null,null,{"$f":"IFERROR(((MAX(C5:D5)-MIN(C5:D5))/MAX(C5:D5))*100,\"\")","v":""},{"$f":"IF(C5=\"\",'Dades pacient'!$C$8,C5)","v":0}]
[null,"Dia 2",null,null,{"$f":"IFERROR(((MAX(C6:D6)-MIN(C6:D6))/MAX(C6:D6))*100,\"\")","v":""},{"$f":"IF(D5=\"\",'Dades pacient'!$D$8,D5)","v":0}]
[null,"Dia 3",null,null,"",{"$f":"IF(C6=\"\",'Dades pacient'!$C$9,C6)","v":0}]
[null,"Dia 4",null,null,"",{"$f":"IF(D6=\"\",'Dades pacient'!$D$9,D6)","v":0}]
[null,"Dia 5",null,null,"",{"$f":"IF(C7=\"\",'Dades pacient'!$C$10,C7)","v":0}]
[null,"Dia 6",null,null,"",{"$f":"IF(D7=\"\",'Dades pacient'!$D$10,D7)","v":0}]
[null,"Dia 7",null,null,"",{"$f":"IF(C8=\"\",'Dades pacient'!$C$11,C8)","v":0}]
[null,"Dia 8",null,null,"",{"$f":"IF(D8=\"\",'Dades pacient'!$D$11,D8)","v":0}]
[null,"Dia 9",null,null,"",{"$f":"IF(C9=\"\",'Dades pacient'!$C$12,C9)","v":0}]
[null,"Dia 10",null,null,"",{"$f":"IF(D9=\"\",'Dades pacient'!$D$12,D9)","v":0}]
[null,"Dia 11",null,null,"",{"$f":"IF(C10=\"\",'Dades pacient'!$C$13,C10)","v":0}]
[null,"Dia 12",null,null,"",{"$f":"IF(D10=\"\",'Dades pacient'!$D$13,D10)","v":0}]
[null,"Dia 13",null,null,"",{"$f":"IF(C11=\"\",'Dades pacient'!$C$14,C11)","v":0}]
[null,"Dia 14",null,null,"",{"$f":"IF(D11=\"\",'Dades pacient'!$D$14,D11)","v":0}]
[null,"Dia 15",null,null,"",{"$f":"IF(C12=\"\",'Dades pacient'!$C$15,C12)","v":0}]
[null,"Dia 16",null,null,"",{"$f":"IF(D12=\"\",'Dades pacient'!$D$15,D12)","v":0}]
[null,"Dia 17",null,null,"",{"$f":"IF(C13=\"\",'Dades pacient'!$C$16,C13)","v":0}]
[null,"Dia 18",null,null,"",{"$f":"IF(D13=\"\",'Dades pacient'!$D$16,D13)","v":0}]
[null,"Dia 19",null,null,"",{"$f":"IF(C14=\"\",'Dades pacient'!$C$17,C14)","v":0}]
[null,"Dia 20",null,null,"",{"$f":"IF(D14=\"\",'Dades pacient'!$D$17,D14)","v":0}]
[null,"Dia 21",null,null,"",{"$f":"IF(C15=\"\",'Dades pacient'!$C$18,C15)","v":0}]
[null,"Dia 22",null,null,"",{"$f":"IF(D15=\"\",'Dades pacient'!$D$18,D15)","v":0}]
[null,"Dia 23",null,null,"",{"$f":"IF(C16=\"\",'Dades pacient'!$C$19,C16)","v":0}]
[null,"Dia 24",null,null,"",{"$f":"IF(D16=\"\",'Dades pacient'!$D$19,D16)","v":0}]
[null,"Dia 25",null,null,"",{"$f":"IF(C17=\"\",'Dades pacient'!$C$20,C17)","v":0}]
[null,"Dia 26",null,null,"",{"$f":"IF(D17=\"\",'Dades pacient'!$D$20,D17)","v":0}]
[null,"Dia 27",null,null,"",{"$f":"IF(C18=\"\",'Dades pacient'!$C$21,C18)","v":0}]
[null,"Dia 28",null,null,"",{"$f":"IF(D18=\"\",'Dades pacient'!$D$21,D18)","v":0}]
[null,"Dia 29",null,null,"",{"$f":"IF(C19=\"\",'Dades pacient'!$C$22,C19)","v":0}]
[null,"Dia 30",null,null,"",{"$f":"IF(D19=\"\",'Dades pacient'!$D$22,D19)","v":0}]
[null,"Dia 31",null,null,""]

{"sheet":"Consulta FEM Teoric","index":2,"n_rows":138,"n_cols":12,"rows_kept":138,"cut":false,"hidden":true,"merged":[]}
["Sexe","Edat","Alçada","FEM Teòric"]
[{"$f":"'Dades pacient'!B3","v":0},{"$f":"IF('Dades pacient'!C3=\"\",\"\",IF('Dades pacient'!C3>14,IF('Dades pacient'!C3<=70,(_xlfn.FLOOR.PRECISE('Dades pacient'!C3,5)),70),14))","v":""},{"$f":"IF('Dades pacient'!D3<190,INDEX(G6:G20,MATCH('Dades pacient'!D3,G6:G20,1)),190)","v":{"$error":"#N/A"}},{"$f":"L7","v":0}]
[]
[]
[]
["Sexe","Edat","Alçada","FEM Teòric",null,null,"Alçada",null,"Sexe","Edat","Alçada","FEM Teòric"]
["Indiferent < 15 anys",14,91,100,null,null,91]
["Indiferent < 15 anys",14,99,120,null,null,99]
["Indiferent < 15 anys",14,107,140,null,null,107]
["Indiferent < 15 anys",14,114,170,null,null,114]
["Indiferent < 15 anys",14,122,210,null,null,122]
["Indiferent < 15 anys",14,130,250,null,null,130]
["Indiferent < 15 anys",14,137,285,null,null,137]
["Indiferent < 15 anys",14,145,325,null,null,145]
["Indiferent < 15 anys",14,152,360,null,null,152]
["Indiferent < 15 anys",14,160,400,null,null,160]
["Indiferent < 15 anys",14,168,440,null,null,168]
["Indiferent < 15 anys",14,175,480,null,null,175]
["Femení",15,145,438,null,null,183]
["Femení",15,152,450,null,null,190]
["Femení",15,160,461]
["Femení",15,168,471]
["Femení",15,175,481]
["Femení",20,145,445]
["Femení",20,152,456]
["Femení",20,160,467]
["Femení",20,168,478]
["Femení",20,175,488]
["Femení",25,145,450]
["Femení",25,152,461]
["Femení",25,160,471]
["Femení",25,168,482]
["Femení",25,175,493]
["Femení",30,145,452]
["Femení",30,152,463]
["Femení",30,160,474]
["Femení",30,168,485]
["Femení",30,175,496]
["Femení",35,145,452]
["Femení",35,152,463]
["Femení",35,160,473]
["Femení",35,168,484]
["Femení",35,175,496]
["Femení",40,145,449]
["Femení",40,152,460]
["Femení",40,160,470]
["Femení",40,168,482]
["Femení",40,175,493]
["Femení",45,145,444]
["Femení",45,152,456]
["Femení",45,160,467]
["Femení",45,168,478]
["Femení",45,175,488]
["Femení",50,145,436]
["Femení",50,152,448]
["Femení",50,160,458]
["Femení",50,168,470]
["Femení",50,175,480]
["Femení",55,145,436]
["Femení",55,152,448]
{"$rows_left_out":79}
{"sheet":"Càlcul FEM Real","index":3,"n_rows":17,"n_cols":4,"rows_kept":17,"cut":false,"hidden":true,"merged":[]}
["DIA","MATI","NIT","Variabilidad"]
[1,{"$f":"'Dades pacient'!C8","v":0},{"$f":"'Dades pacient'!D8","v":0},{"$f":"((MAX(B2:C2)-MIN(B2:C2))/MAX(B2:C2))*100","v":{"$error":"#DIV/0!"}}]
[2,{"$f":"'Dades pacient'!C9","v":0},{"$f":"'Dades pacient'!D9","v":0},{"$f":"((MAX(B3:C3)-MIN(B3:C3))/MAX(B3:C3))*100","v":{"$error":"#DIV/0!"}}]
[3,{"$f":"'Dades pacient'!C10","v":0},{"$f":"'Dades pacient'!D10","v":0},{"$error":"#DIV/0!"}]
[4,{"$f":"'Dades pacient'!C11","v":0},{"$f":"'Dades pacient'!D11","v":0},{"$error":"#DIV/0!"}]
[5,{"$f":"'Dades pacient'!C12","v":0},{"$f":"'Dades pacient'!D12","v":0},{"$error":"#DIV/0!"}]
[6,{"$f":"'Dades pacient'!C13","v":0},{"$f":"'Dades pacient'!D13","v":0},{"$error":"#DIV/0!"}]
[7,{"$f":"'Dades pacient'!C14","v":0},{"$f":"'Dades pacient'!D14","v":0},{"$error":"#DIV/0!"}]
[8,{"$f":"'Dades pacient'!C15","v":0},{"$f":"'Dades pacient'!D15","v":0},{"$error":"#DIV/0!"}]
[9,{"$f":"'Dades pacient'!C16","v":0},{"$f":"'Dades pacient'!D16","v":0},{"$error":"#DIV/0!"}]
[10,{"$f":"'Dades pacient'!C17","v":0},{"$f":"'Dades pacient'!D17","v":0},{"$error":"#DIV/0!"}]
[11,{"$f":"'Dades pacient'!C18","v":0},{"$f":"'Dades pacient'!D18","v":0},{"$error":"#DIV/0!"}]
[12,{"$f":"'Dades pacient'!C19","v":0},{"$f":"'Dades pacient'!D19","v":0},{"$error":"#DIV/0!"}]
[13,{"$f":"'Dades pacient'!C20","v":0},{"$f":"'Dades pacient'!D20","v":0},{"$error":"#DIV/0!"}]
[14,{"$f":"'Dades pacient'!C21","v":0},{"$f":"'Dades pacient'!D21","v":0},{"$error":"#DIV/0!"}]
[15,{"$f":"'Dades pacient'!C22","v":0},{"$f":"'Dades pacient'!D22","v":0},{"$f":"((MAX(B16:C16)-MIN(B16:C16))/MAX(B16:C16))*100","v":{"$error":"#DIV/0!"}}]
["FEM TEORIC",{"$f":"'Consulta FEM Teoric'!D2","v":0},{"$f":"'Consulta FEM Teoric'!D2","v":0}]

{"sheet":"Dades gràfic","index":4,"n_rows":65,"n_cols":7,"rows_kept":65,"cut":false,"hidden":true,"merged":[]}
["Columna1","Dia ","Valor pacient","80%","60%","40%","FEM Real"]
["Mati",0,null,{"$f":"$G$40*0.8","v":{"$error":"#VALUE!"}},{"$f":"$G$40*0.6","v":{"$error":"#VALUE!"}},{"$f":"$G$34*0.4","v":{"$error":"#VALUE!"}}]
["Nit",0.5,null,{"$error":"#VALUE!"},{"$error":"#VALUE!"},{"$f":"$G$34*0.4","v":{"$error":"#VALUE!"}}]
["M",1,{"$f":"IF('Seguiment FEM Real'!F5>1,'Seguiment FEM Real'!F5,\"\")","v":""},{"$error":"#VALUE!"},{"$error":"#VALUE!"},{"$f":"$G$40*0.4","v":{"$error":"#VALUE!"}},{"$f":"IF('Càlcul FEM Real'!B2=\"\",\"\",'Càlcul FEM Real'!B2)","v":0}]
["N ",1.5,{"$f":"IF('Seguiment FEM Real'!F6>1,'Seguiment FEM Real'!F6,\"\")","v":""},{"$error":"#VALUE!"},{"$error":"#VALUE!"},{"$f":"$G$40*0.4","v":{"$error":"#VALUE!"}},{"$f":"IF('Càlcul FEM Real'!C2=\"\",\"\",'Càlcul FEM Real'!C2)","v":0}]
["M",2,{"$f":"IF('Seguiment FEM Real'!F7>1,'Seguiment FEM Real'!F7,\"\")","v":""},{"$error":"#VALUE!"},{"$error":"#VALUE!"},{"$error":"#VALUE!"},{"$f":"IF('Càlcul FEM Real'!B3=\"\",\"\",'Càlcul FEM Real'!B3)","v":0}]
["N ",2.5,{"$f":"IF('Seguiment FEM Real'!F8>1,'Seguiment FEM Real'!F8,\"\")","v":""},{"$error":"#VALUE!"},{"$error":"#VALUE!"},{"$error":"#VALUE!"},{"$f":"IF('Càlcul FEM Real'!C3=\"\",\"\",'Càlcul FEM Real'!C3)","v":0}]
["M",3,{"$f":"IF('Seguiment FEM Real'!F9>1,'Seguiment FEM Real'!F9,\"\")","v":""},{"$error":"#VALUE!"},{"$error":"#VALUE!"},{"$error":"#VALUE!"},{"$f":"IF('Càlcul FEM Real'!B4=\"\",\"\",'Càlcul FEM Real'!B4)","v":0}]
["N ",3.5,{"$f":"IF('Seguiment FEM Real'!F10>1,'Seguiment FEM Real'!F10,\"\")","v":""},{"$error":"#VALUE!"},{"$error":"#VALUE!"},{"$error":"#VALUE!"},{"$f":"IF('Càlcul FEM Real'!C4=\"\",\"\",'Càlcul FEM Real'!C4)","v":0}]
["M",4,{"$f":"IF('Seguiment FEM Real'!F11>1,'Seguiment FEM Real'!F11,\"\")","v":""},{"$error":"#VALUE!"},{"$error":"#VALUE!"},{"$error":"#VALUE!"},{"$f":"IF('Càlcul FEM Real'!B5=\"\",\"\",'Càlcul FEM Real'!B5)","v":0}]
["N ",4.5,{"$f":"IF('Seguiment FEM Real'!F12>1,'Seguiment FEM Real'!F12,\"\")","v":""},{"$error":"#VALUE!"},{"$error":"#VALUE!"},{"$error":"#VALUE!"},{"$f":"IF('Càlcul FEM Real'!C5=\"\",\"\",'Càlcul FEM Real'!C5)","v":0}]
["M",5,{"$f":"IF('Seguiment FEM Real'!F13>1,'Seguiment FEM Real'!F13,\"\")","v":""},{"$error":"#VALUE!"},{"$error":"#VALUE!"},{"$error":"#VALUE!"},{"$f":"IF('Càlcul FEM Real'!B6=\"\",\"\",'Càlcul FEM Real'!B6)","v":0}]
["N ",5.5,{"$f":"IF('Seguiment FEM Real'!F14>1,'Seguiment FEM Real'!F14,\"\")","v":""},{"$error":"#VALUE!"},{"$error":"#VALUE!"},{"$error":"#VALUE!"},{"$f":"IF('Càlcul FEM Real'!C6=\"\",\"\",'Càlcul FEM Real'!C6)","v":0}]
["M",6,{"$f":"IF('Seguiment FEM Real'!F15>1,'Seguiment FEM Real'!F15,\"\")","v":""},{"$error":"#VALUE!"},{"$error":"#VALUE!"},{"$error":"#VALUE!"},{"$f":"IF('Càlcul FEM Real'!B7=\"\",\"\",'Càlcul FEM Real'!B7)","v":0}]
["N ",6.5,{"$f":"IF('Seguiment FEM Real'!F16>1,'Seguiment FEM Real'!F16,\"\")","v":""},{"$error":"#VALUE!"},{"$error":"#VALUE!"},{"$error":"#VALUE!"},{"$f":"IF('Càlcul FEM Real'!C7=\"\",\"\",'Càlcul FEM Real'!C7)","v":0}]
["M",7,{"$f":"IF('Seguiment FEM Real'!F17>1,'Seguiment FEM Real'!F17,\"\")","v":""},{"$error":"#VALUE!"},{"$error":"#VALUE!"},{"$error":"#VALUE!"},{"$f":"IF('Càlcul FEM Real'!B8=\"\",\"\",'Càlcul FEM Real'!B8)","v":0}]
["N ",7.5,{"$f":"IF('Seguiment FEM Real'!F18>1,'Seguiment FEM Real'!F18,\"\")","v":""},{"$error":"#VALUE!"},{"$error":"#VALUE!"},{"$error":"#VALUE!"},{"$f":"IF('Càlcul FEM Real'!C8=\"\",\"\",'Càlcul FEM Real'!C8)","v":0}]
["M",8,{"$f":"IF('Seguiment FEM Real'!F19>1,'Seguiment FEM Real'!F19,\"\")","v":""},{"$error":"#VALUE!"},{"$error":"#VALUE!"},{"$error":"#VALUE!"},{"$f":"IF('Càlcul FEM Real'!B9=\"\",\"\",'Càlcul FEM Real'!B9)","v":0}]
["N ",8.5,{"$f":"IF('Seguiment FEM Real'!F20>1,'Seguiment FEM Real'!F20,\"\")","v":""},{"$error":"#VALUE!"},{"$error":"#VALUE!"},{"$error":"#VALUE!"},{"$f":"IF('Càlcul FEM Real'!C9=\"\",\"\",'Càlcul FEM Real'!C9)","v":0}]
["M",9,{"$f":"IF('Seguiment FEM Real'!F21>1,'Seguiment FEM Real'!F21,\"\")","v":""},{"$error":"#VALUE!"},{"$error":"#VALUE!"},{"$error":"#VALUE!"},{"$f":"IF('Càlcul FEM Real'!B10=\"\",\"\",'Càlcul FEM Real'!B10)","v":0}]
["N ",9.5,{"$f":"IF('Seguiment FEM Real'!F22>1,'Seguiment FEM Real'!F22,\"\")","v":""},{"$error":"#VALUE!"},{"$error":"#VALUE!"},{"$error":"#VALUE!"},{"$f":"IF('Càlcul FEM Real'!C10=\"\",\"\",'Càlcul FEM Real'!C10)","v":0}]
["M",10,{"$f":"IF('Seguiment FEM Real'!F23>1,'Seguiment FEM Real'!F23,\"\")","v":""},{"$error":"#VALUE!"},{"$error":"#VALUE!"},{"$error":"#VALUE!"},{"$f":"IF('Càlcul FEM Real'!B11=\"\",\"\",'Càlcul FEM Real'!B11)","v":0}]
["N ",10.5,{"$f":"IF('Seguiment FEM Real'!F24>1,'Seguiment FEM Real'!F24,\"\")","v":""},{"$error":"#VALUE!"},{"$error":"#VALUE!"},{"$error":"#VALUE!"},{"$f":"IF('Càlcul FEM Real'!C11=\"\",\"\",'Càlcul FEM Real'!C11)","v":0}]
["M",11,{"$f":"IF('Seguiment FEM Real'!F25>1,'Seguiment FEM Real'!F25,\"\")","v":""},{"$error":"#VALUE!"},{"$error":"#VALUE!"},{"$error":"#VALUE!"},{"$f":"IF('Càlcul FEM Real'!B12=\"\",\"\",'Càlcul FEM Real'!B12)","v":0}]
["N ",11.5,{"$f":"IF('Seguiment FEM Real'!F26>1,'Seguiment FEM Real'!F26,\"\")","v":""},{"$error":"#VALUE!"},{"$error":"#VALUE!"},{"$error":"#VALUE!"},{"$f":"IF('Càlcul FEM Real'!C12=\"\",\"\",'Càlcul FEM Real'!C12)","v":0}]
["M",12,{"$f":"IF('Seguiment FEM Real'!F27>1,'Seguiment FEM Real'!F27,\"\")","v":""},{"$error":"#VALUE!"},{"$error":"#VALUE!"},{"$error":"#VALUE!"},{"$f":"IF('Càlcul FEM Real'!B13=\"\",\"\",'Càlcul FEM Real'!B13)","v":0}]
["N ",12.5,{"$f":"IF('Seguiment FEM Real'!F28>1,'Seguiment FEM Real'!F28,\"\")","v":""},{"$error":"#VALUE!"},{"$error":"#VALUE!"},{"$error":"#VALUE!"},{"$f":"IF('Càlcul FEM Real'!C13=\"\",\"\",'Càlcul FEM Real'!C13)","v":0}]
["M",13,{"$f":"IF('Seguiment FEM Real'!F29>1,'Seguiment FEM Real'!F29,\"\")","v":""},{"$error":"#VALUE!"},{"$error":"#VALUE!"},{"$error":"#VALUE!"},{"$f":"IF('Càlcul FEM Real'!B14=\"\",\"\",'Càlcul FEM Real'!B14)","v":0}]
["N ",13.5,{"$f":"IF('Seguiment FEM Real'!F30>1,'Seguiment FEM Real'!F30,\"\")","v":""},{"$error":"#VALUE!"},{"$error":"#VALUE!"},{"$error":"#VALUE!"},{"$f":"IF('Càlcul FEM Real'!C14=\"\",\"\",'Càlcul FEM Real'!C14)","v":0}]
["M",14,{"$f":"IF('Seguiment FEM Real'!F31>1,'Seguiment FEM Real'!F31,\"\")","v":""},{"$error":"#VALUE!"},{"$error":"#VALUE!"},{"$error":"#VALUE!"},{"$f":"IF('Càlcul FEM Real'!B15=\"\",\"\",'Càlcul FEM Real'!B15)","v":0}]
["N ",14.5,{"$f":"IF('Seguiment FEM Real'!F32>1,'Seguiment FEM Real'!F32,\"\")","v":""},{"$error":"#VALUE!"},{"$error":"#VALUE!"},{"$error":"#VALUE!"},{"$f":"IF('Càlcul FEM Real'!C15=\"\",\"\",'Càlcul FEM Real'!C15)","v":0}]
["M",15,{"$f":"IF('Seguiment FEM Real'!F33>1,'Seguiment FEM Real'!F33,\"\")","v":""},{"$error":"#VALUE!"},{"$error":"#VALUE!"},{"$error":"#VALUE!"},{"$f":"IF('Càlcul FEM Real'!B16=\"\",\"\",'Càlcul FEM Real'!B16)","v":0}]
["N ",15.5,{"$f":"IF('Seguiment FEM Real'!F34>1,'Seguiment FEM Real'!F34,\"\")","v":""},{"$error":"#VALUE!"},{"$error":"#VALUE!"},{"$error":"#VALUE!"},{"$f":"IF('Càlcul FEM Real'!C16=\"\",\"\",'Càlcul FEM Real'!C16)","v":0}]
["M",16,{"$f":"IF('Seguiment FEM Real'!C20>1,'Seguiment FEM Real'!C20,\"\")","v":""},{"$f":"$G$40*0.8","v":{"$error":"#VALUE!"}},{"$f":"$G$40*0.6","v":{"$error":"#VALUE!"}},{"$error":"#VALUE!"},{"$f":"IF(MAX(G4:G33)=0,\"\",MAX(G4:G33))","v":""}]
["N ",16.5,{"$f":"IF('Seguiment FEM Real'!D20>1,'Seguiment FEM Real'!D20,\"\")","v":""},{"$error":"#VALUE!"},{"$error":"#VALUE!"},{"$error":"#VALUE!"}]
["M",17,{"$f":"IF('Seguiment FEM Real'!C21>1,'Seguiment FEM Real'!C21,\"\")","v":""},{"$error":"#VALUE!"},{"$error":"#VALUE!"},{"$error":"#VALUE!"},"FEM Teòric"]
["N ",17.5,{"$f":"IF('Seguiment FEM Real'!D21>1,'Seguiment FEM Real'!D21,\"\")","v":""},{"$error":"#VALUE!"},{"$error":"#VALUE!"},{"$error":"#VALUE!"},{"$f":"IF('Càlcul FEM Real'!B17,'Càlcul FEM Real'!C17,\"\")","v":""}]
["M",18,{"$f":"IF('Seguiment FEM Real'!C22>1,'Seguiment FEM Real'!C22,\"\")","v":""},{"$error":"#VALUE!"},{"$error":"#VALUE!"},{"$error":"#VALUE!"}]
["N ",18.5,{"$f":"IF('Seguiment FEM Real'!D22>1,'Seguiment FEM Real'!D22,\"\")","v":""},{"$error":"#VALUE!"},{"$error":"#VALUE!"},{"$error":"#VALUE!"},"FEM pacient"]
["M",19,{"$f":"IF('Seguiment FEM Real'!C23>1,'Seguiment FEM Real'!C23,\"\")","v":""},{"$error":"#VALUE!"},{"$error":"#VALUE!"},{"$error":"#VALUE!"},{"$f":"IF(G34=\"\",G37,G34)","v":""}]
["N ",19.5,{"$f":"IF('Seguiment FEM Real'!D23>1,'Seguiment FEM Real'!D23,\"\")","v":""},{"$error":"#VALUE!"},{"$error":"#VALUE!"},{"$error":"#VALUE!"}]
["M",20,{"$f":"IF('Seguiment FEM Real'!C24>1,'Seguiment FEM Real'!C24,\"\")","v":""},{"$error":"#VALUE!"},{"$error":"#VALUE!"},{"$error":"#VALUE!"}]
["N ",20.5,{"$f":"IF('Seguiment FEM Real'!D24>1,'Seguiment FEM Real'!D24,\"\")","v":""},{"$error":"#VALUE!"},{"$error":"#VALUE!"},{"$error":"#VALUE!"}]
["M",21,{"$f":"IF('Seguiment FEM Real'!C25>1,'Seguiment FEM Real'!C25,\"\")","v":""},{"$error":"#VALUE!"},{"$error":"#VALUE!"},{"$error":"#VALUE!"}]
["N ",21.5,{"$f":"IF('Seguiment FEM Real'!D25>1,'Seguiment FEM Real'!D25,\"\")","v":""},{"$error":"#VALUE!"},{"$error":"#VALUE!"},{"$error":"#VALUE!"}]
["M",22,{"$f":"IF('Seguiment FEM Real'!C26>1,'Seguiment FEM Real'!C26,\"\")","v":""},{"$error":"#VALUE!"},{"$error":"#VALUE!"},{"$error":"#VALUE!"}]
["N ",22.5,{"$f":"IF('Seguiment FEM Real'!D26>1,'Seguiment FEM Real'!D26,\"\")","v":""},{"$error":"#VALUE!"},{"$error":"#VALUE!"},{"$error":"#VALUE!"}]
["M",23,{"$f":"IF('Seguiment FEM Real'!C27>1,'Seguiment FEM Real'!C27,\"\")","v":""},{"$error":"#VALUE!"},{"$error":"#VALUE!"},{"$error":"#VALUE!"}]
["N ",23.5,{"$f":"IF('Seguiment FEM Real'!D27>1,'Seguiment FEM Real'!D27,\"\")","v":""},{"$error":"#VALUE!"},{"$error":"#VALUE!"},{"$error":"#VALUE!"}]
["M",24,{"$f":"IF('Seguiment FEM Real'!C28>1,'Seguiment FEM Real'!C28,\"\")","v":""},{"$error":"#VALUE!"},{"$error":"#VALUE!"},{"$error":"#VALUE!"}]
["N ",24.5,{"$f":"IF('Seguiment FEM Real'!D28>1,'Seguiment FEM Real'!D28,\"\")","v":""},{"$error":"#VALUE!"},{"$error":"#VALUE!"},{"$error":"#VALUE!"}]
["M",25,{"$f":"IF('Seguiment FEM Real'!C29>1,'Seguiment FEM Real'!C29,\"\")","v":""},{"$error":"#VALUE!"},{"$error":"#VALUE!"},{"$error":"#VALUE!"}]
["N ",25.5,{"$f":"IF('Seguiment FEM Real'!D29>1,'Seguiment FEM Real'!D29,\"\")","v":""},{"$error":"#VALUE!"},{"$error":"#VALUE!"},{"$error":"#VALUE!"}]
["M",26,{"$f":"IF('Seguiment FEM Real'!C30>1,'Seguiment FEM Real'!C30,\"\")","v":""},{"$error":"#VALUE!"},{"$error":"#VALUE!"},{"$error":"#VALUE!"}]
["N ",26.5,{"$f":"IF('Seguiment FEM Real'!D30>1,'Seguiment FEM Real'!D30,\"\")","v":""},{"$error":"#VALUE!"},{"$error":"#VALUE!"},{"$error":"#VALUE!"}]
["M",27,{"$f":"IF('Seguiment FEM Real'!C31>1,'Seguiment FEM Real'!C31,\"\")","v":""},{"$error":"#VALUE!"},{"$error":"#VALUE!"},{"$error":"#VALUE!"}]
["N ",27.5,{"$f":"IF('Seguiment FEM Real'!D31>1,'Seguiment FEM Real'!D31,\"\")","v":""},{"$error":"#VALUE!"},{"$error":"#VALUE!"},{"$error":"#VALUE!"}]
["M",28,{"$f":"IF('Seguiment FEM Real'!C32>1,'Seguiment FEM Real'!C32,\"\")","v":""},{"$error":"#VALUE!"},{"$error":"#VALUE!"},{"$error":"#VALUE!"}]
["N ",28.5,{"$f":"IF('Seguiment FEM Real'!D32>1,'Seguiment FEM Real'!D32,\"\")","v":""},{"$error":"#VALUE!"},{"$error":"#VALUE!"},{"$error":"#VALUE!"}]
["M",29,{"$f":"IF('Seguiment FEM Real'!C33>1,'Seguiment FEM Real'!C33,\"\")","v":""},{"$error":"#VALUE!"},{"$error":"#VALUE!"},{"$error":"#VALUE!"}]
{"$rows_left_out":6}
{"sheet":"Full Pacient","index":5,"n_rows":46,"n_cols":18,"rows_kept":46,"cut":false,"hidden":false,"merged":[[34,16,35,17],[2,2,2,5],[2,11,2,14],[34,2,34,3],[5,10,5,14],[7,10,7,15],[22,12,22,15],[29,12,29,15],[5,1,5,5],[7,1,7,6],[14,1,14,5],[14,10,14,14],[34,1,35,1],[34,7,35,8],[34,4,34,6],[22,3,22,6],[29,3,29,6],[34,10,35,10],[34,11,34,12],[34,13,34,15]]}
[]
[]
[null,"Nom:",null,null,null,null,null,"Millor FEM:",{"$f":"'Dades gràfic'!G40","v":""},null,"Nom:",{"$f":"IF(C3=\"\",\"\",C3)","v":""},null,null,null,null,"Millor FEM:",{"$f":"'Dades gràfic'!G40","v":""}]
[]
[null,"Tractament de manteniment",null,null,null,null,null,"FEM:","> 80%",null,"Tratamiento de mantenimiento",null,null,null,null,null,"FEM:","> 80%"]
[null,"Si no te molèsties i el seu FEM està per sobre de",null,null,null,null,{"$f":"Taula5[FEM 80%]","v":""},null,null,null,"Si no tiene ninguna molestia y su FEM está por encima de",null,null,null,null,{"$f":"Taula5[FEM 80%]","v":""}]
[null,"Segueixi amb el seu tractament habitual:",null,null,null,null,null,null,null,null,"Siga con su tratamiento habitual:"]
[null,null,null,null,null,null,null,null,null,null,{"$f":"IF(B8=\"\",\"\",B8)","v":""}]
[]
[]
[null,"Tractament de crisi lleu",null,null,null,null,null,"FEM:","60-80%",null,"Tratamiento de crisis leve",null,null,null,null,null,"FEM:","60-80%"]
[null,"Si te molèsties (tos, xiulets, cansament o opressió toràcica) o",null,null,null,null,null,null,null,null,"Si tiene molestias (tos, pitos, cansancio u opressión torácica) o"]
[null,"el FEM està entre ",null,{"$f":"'Dades pacient'!C26","v":""},"i",{"$f":"Taula5[FEM 80%]","v":""},null,null,null,null,"el FEM está entre",null,{"$f":"'Dades pacient'!C26","v":""},"y",{"$f":"Taula5[FEM 80%]","v":""}]
[null,"Prengui:",null,null,null,null,null,null,null,null,"Tome:"]
[null,{"$f":"IF('Dades pacient'!B32=\"\",\"\",'Dades pacient'!B32)","v":""},null,null,null,null,null,null,null,null,{"$f":"IF('Dades pacient'!B32=\"\",\"\",'Dades pacient'!B32)","v":""}]
[]
[null,"Si no millora en dos dies, contacti amb el seu metge de ",null,null,null,null,null,null,null,null,"Si no mejora en dos días, póngase en contacto con su médico "]
[null,"referència",null,null,null,null,null,null,null,null,"referencia"]
[]
[]
[null,"Tractament de crisi moderada",null,null,null,null,null,"FEM:","40-60%",null,"Tratamiento de crisis moderada",null,null,null,null,null,"FEM:","40-60%"]
[null,"Si el seu FEM està entre",null,null,{"$f":"'Dades pacient'!D26","v":""},"i",{"$f":"'Dades pacient'!C26","v":""},null,null,null,"Si su FEM está entre",null,null,{"$f":"'Dades pacient'!D26","v":""},"y",{"$f":"'Dades pacient'!C26","v":""}]
[null,"Comenci dosi de",null,{"$f":"IF('Dades pacient'!B33=\"\",\"\",'Dades pacient'!B33)","v":""},null,null,null,null,null,null,"Comience dosis de",null,{"$f":"IF('Dades pacient'!B33=\"\",\"\",'Dades pacient'!B33)","v":""}]
[]
[null,"i demani visita mèdica inmediata amb el seu metge de referència",null,null,null,null,null,null,null,null,"y solicite una visita médica inmediata con su médico"]
[]
[]
[null,"Tractament de crisi greu",null,null,null,null,null,"FEM:","< 40%",null,"Tratamiento de crisis graves",null,null,null,null,null,"FEM:","< 40%"]
[null,"Si el seu FEM es inferior a",null,null,{"$f":"'Dades pacient'!D26","v":""},null,null,null,null,null,"Si su FEM es inferior a",null,null,{"$f":"'Dades pacient'!D26","v":""}]
[null,"Prengui",null,{"$f":"IF('Dades pacient'!B36=\"\",\"\",'Dades pacient'!B36)","v":""},null,null,null,null,null,null,"Tome",null,{"$f":"IF('Dades pacient'!B36=\"\",\"\",'Dades pacient'!B36)","v":""}]
[null,null,"i",null,null,null,null,null,null,null,null,"y"]
[null,null,null,"Acudeixi a urgències",null,null,null,null,null,null,null,null,"Acuda a urgencias"]
[]
[]
[null,"Dia","Mesures FEM",null,"Símptomes",null,null,"Inhalador i núm. d'inhalacions",null,null,"Día","Medidas FEM",null,"Síntomas",null,null,"Inhalador y núm de inhalaciones"]
[null,null,"Matí","Tarda","Ofec","Tos","Desp.Noct.",null,null,null,null,"Mañana","Tarde","Ahogo","Tos","Desp.Noct."]
[null,1,null,null,null,null,null,null,null,null,1]
[null,2,null,null,null,null,null,null,null,null,2]
[null,3,null,null,null,null,null,null,null,null,3]
[null,4,null,null,null,null,null,null,null,null,4]
[null,5,null,null,null,null,null,null,null,null,5]
[null,6,null,null,null,null,null,null,null,null,6]
[null,7,null,null,null,null,null,null,null,null,7]
[null,8,null,null,null,null,null,null,null,null,8]
[null,9,null,null,null,null,null,null,null,null,9]
[null,10,null,null,null,null,null,null,null,null,10]

{"sheet":"Grafic Setmanal","index":6,"n_rows":26,"n_cols":15,"rows_kept":26,"cut":false,"hidden":false,"merged":[[0,3,0,7],[0,9,0,15],[1,14,1,15],[1,2,1,3],[1,4,1,5],[1,6,1,7],[1,8,1,9],[1,10,1,11],[1,12,1,13]]}
[null,null,"ANY:",null,null,null,null,null,"MES:"]
[null,"DIA",1,null,2,null,3,null,4,null,5,null,6,null,7]
[]
[]
[]
[null,"Millor FEM:"]
[null,{"$f":"'Dades gràfic'!G40","v":""}]
[]
[]
[]
[]
[]
[]
[]
[]
[]
[]
[]
[]
[]
[]
[null,"Xiulets"]
[null,"Tos"]
[null,"Opressió"]
[]
[null,"Medicació"]

{"sheet":"Bibliografia","index":7,"n_rows":0,"n_cols":0,"rows_kept":0,"cut":false,"hidden":false,"merged":[]}